Target
Heat shock protein HSP 90-alpha
Ligand
BDBM50180304
Substrate
Meas. Tech.
biochemical assay
EC50
>15000±n/a nM
Citation
 Chiosis, GHe, HLlauger-Bufi, LKim, JLarson, SMSmith-Jones, P Small-molecule HSP90 inhibitors US Patent  US10676476 Publication Date 6/9/2020 
Target
Name:
Heat shock protein HSP 90-alpha
Synonyms:
HS90A_HUMAN HSP86 HSP90AA1 HSPCA Heat shock 86 kDa Heat shock protein HSP 90-alpha (HSP90) LAP-2 Lipopolysaccharide-associated protein 2 heat shock protein 90kDa alpha (cytosolic), class A member 1 isoform 2
Type:
Molecular Chaperone
Mol. Mass.:
84623.45
Organism:
Homo sapiens (Human)
Description:
P07900
Residue:
732
  
Inhibitor
Name:
BDBM50180304
Synonyms:
2-fluoro-8-(2-bromo-4,5-dimethoxy-benzyl)-9-(pent-4-ynyl)-adenine US10676476, Example 13
Type:
Small organic molecule
Emp. Form.:
C19H19BrFN5O2
Mol. Mass.:
448.289
SMILES:
COc1cc(Br)c(Cc2nc3c(N)nc(F)nc3n2CCCC#C)cc1OC
: