Target
Receptor tyrosine-protein kinase erbB-2
Ligand
BDBM50180304
Substrate
Meas. Tech.
biochemical assay
IC50
>50000±n/a nM
Citation
 Chiosis, GHe, HLlauger-Bufi, LKim, JLarson, SMSmith-Jones, P Small-molecule HSP90 inhibitors US Patent  US10676476 Publication Date 6/9/2020 
Target
Name:
Receptor tyrosine-protein kinase erbB-2
Synonyms:
2.7.10.1 CD_antigen=CD340 ERBB2_HUMAN FASN/HER2 HER2 MLN19 NEU Proto-oncogene Neu Tyrosine kinase-type cell surface receptor HER2 | p185erbB2
Type:
Mol. Mass.:
137894.47
Organism:
Homo sapiens (Human)
Description:
P04626
Residue:
1255
  
Inhibitor
Name:
BDBM50180304
Synonyms:
2-fluoro-8-(2-bromo-4,5-dimethoxy-benzyl)-9-(pent-4-ynyl)-adenine US10676476, Example 13
Type:
Small organic molecule
Emp. Form.:
C19H19BrFN5O2
Mol. Mass.:
448.289
SMILES:
COc1cc(Br)c(Cc2nc3c(N)nc(F)nc3n2CCCC#C)cc1OC
: