Target
Receptor tyrosine-protein kinase erbB-2
Ligand
BDBM50165281
Substrate
Meas. Tech.
biochemical assay
IC50
1300±400 nM
Citation
 Chiosis, GHe, HLlauger-Bufi, LKim, JLarson, SMSmith-Jones, P Small-molecule HSP90 inhibitors US Patent  US10676476 Publication Date 6/9/2020 
Target
Name:
Receptor tyrosine-protein kinase erbB-2
Synonyms:
2.7.10.1 CD_antigen=CD340 ERBB2_HUMAN FASN/HER2 HER2 MLN19 NEU Proto-oncogene Neu Tyrosine kinase-type cell surface receptor HER2 | p185erbB2
Type:
Mol. Mass.:
137894.47
Organism:
Homo sapiens (Human)
Description:
P04626
Residue:
1255
  
Inhibitor
Name:
BDBM50165281
Synonyms:
8-(2-Chloro-3,4,5-trimethoxy-phenylsulfanyl)-2-fluoro-9-pent-4-ynyl-9H-purin-6-ylamine CHEMBL193282 | US10676476, Comp 2
Type:
Small organic molecule
Emp. Form.:
C19H19ClFN5O3S
Mol. Mass.:
451.902
SMILES:
COc1cc(Sc2nc3c(N)nc(F)nc3n2CCCC#C)c(Cl)c(OC)c1OC
: