Target
Protein arginine N-methyltransferase 5
Ligand
BDBM50523661
Substrate
Meas. Tech.
Biochemical Assay
IC50
1.000±n/a nM
Citation
 Tatlock, JHMcAlpine, IJTran-Dube, MBRui, EYWythes, MJKumpf, RAMcTigue, MAPatman, R Substituted carbonucleoside derivatives useful as anticancer agents US Patent  US10709709 Publication Date 7/14/2020 
Target
Name:
Protein arginine N-methyltransferase 5
Synonyms:
72 kDa ICln-binding protein HRMT1L5 IBP72 Jak-binding protein 1 PRMT5/MEP50 complex Protein arginine methyltransferase 5 (PRMT5) SKB1 homolog Shk1 kinase-binding protein 1 homolog
Type:
Enzyme
Mol. Mass.:
72679.99
Organism:
Homo sapiens (Human)
Description:
O14744
Residue:
637
  
Inhibitor
Name:
BDBM50523661
Synonyms:
CHEMBL4547524 | US10709709, Example 154
Type:
Small organic molecule
Emp. Form.:
C22H24F2N4O3
Mol. Mass.:
430.4478
SMILES:
Cc1ncnc2n(ccc12)[C@@H]1C[C@H](Oc2cc(cc3CCNCc23)C(F)F)[C@@H](O)[C@H]1O
: