Target
RAF proto-oncogene serine/threonine-protein kinase
Ligand
BDBM81169
Substrate
Meas. Tech.
In Vitro Activity Assay
IC50
2.40±n/a nM
Citation
 Aversa, RJBarsanti, PABurger, MTDillon, MPDipesa, AHu, CLou, YNishiguchi, GAPan, YPolyakov, VRRamurthy, SRico, ACSetti, LQSmith, ASubramanian, STaft, BRTanner, HRWan, LYusuff, N Biaryl amide compounds as kinase inhibitors US Patent  US10709712 Publication Date 7/14/2020 
Target
Name:
RAF proto-oncogene serine/threonine-protein kinase
Synonyms:
C-Raf Protein Kinase RAF RAF1 Raf-1 Serine/threonine-protein kinase C-Raf | cRaf
Type:
Serine/threonine-protein kinase
Mol. Mass.:
73082.52
Organism:
Homo sapiens (Human)
Description:
P04049
Residue:
648
  
Inhibitor
Name:
BDBM81169
Synonyms:
US10245267, Example 467 US9694016, 467
Type:
Small organic molecule
Emp. Form.:
C31H35F3N4O5
Mol. Mass.:
600.6286
SMILES:
Cc1ccc(cc1-c1cc(N2CCOCC2)c(=O)n(C)c1)C(=O)Nc1ccc(CNC(=O)OC(C)(C)C)c(c1)C(F)(F)F
: