Target
RAF proto-oncogene serine/threonine-protein kinase
Ligand
BDBM81352
Substrate
Meas. Tech.
In Vitro Activity Assay
IC50
0.800±n/a nM
Citation
 Aversa, RJBarsanti, PABurger, MTDillon, MPDipesa, AHu, CLou, YNishiguchi, GAPan, YPolyakov, VRRamurthy, SRico, ACSetti, LQSmith, ASubramanian, STaft, BRTanner, HRWan, LYusuff, N Biaryl amide compounds as kinase inhibitors US Patent  US10709712 Publication Date 7/14/2020 
Target
Name:
RAF proto-oncogene serine/threonine-protein kinase
Synonyms:
C-Raf Protein Kinase RAF RAF1 Raf-1 Serine/threonine-protein kinase C-Raf | cRaf
Type:
Serine/threonine-protein kinase
Mol. Mass.:
73082.52
Organism:
Homo sapiens (Human)
Description:
P04049
Residue:
648
  
Inhibitor
Name:
BDBM81352
Synonyms:
US10245267, Example 555 US9694016, 552 | US9694016, 555
Type:
Small organic molecule
Emp. Form.:
C25H28FN5O3
Mol. Mass.:
465.5199
SMILES:
COc1nnc(cc1N1CCOCC1)-c1cc(NC(=O)c2ccnc(c2)C(C)(C)F)ccc1C
: