Target
RAF proto-oncogene serine/threonine-protein kinase
Ligand
BDBM88129
Substrate
Meas. Tech.
In Vitro Activity Assay
IC50
0.120±n/a nM
Citation
 Aversa, RJBarsanti, PABurger, MTDillon, MPDipesa, AHu, CLou, YNishiguchi, GAPan, YPolyakov, VRRamurthy, SRico, ACSetti, LQSmith, ASubramanian, STaft, BRTanner, HRWan, LYusuff, N Biaryl amide compounds as kinase inhibitors US Patent  US10709712 Publication Date 7/14/2020 
Target
Name:
RAF proto-oncogene serine/threonine-protein kinase
Synonyms:
C-Raf Protein Kinase RAF RAF1 Raf-1 Serine/threonine-protein kinase C-Raf | cRaf
Type:
Serine/threonine-protein kinase
Mol. Mass.:
73082.52
Organism:
Homo sapiens (Human)
Description:
P04049
Residue:
648
  
Inhibitor
Name:
BDBM88129
Synonyms:
US10245267, Example 1164 US9694016, 1164
Type:
Small organic molecule
Emp. Form.:
C24H24F3N5O4
Mol. Mass.:
503.4737
SMILES:
Cc1ccc(NC(=O)c2cnnc(c2)C(F)(F)F)cc1-c1cc(OCCO)nc(c1)N1CCOCC1
: