Target
Serine/threonine-protein kinase receptor R3 [166-493]
Ligand
BDBM451789
Substrate
Meas. Tech.
Caliper Assay
IC50
55.0±n/a nM
Citation
 Arista, LBabu, SBian, JCui, KDillon, MPLattmann, RLi, JLiao, LLizos, DRamos, RStiefl, NJUllrich, TUsselmann, PWang, XWaykole, LMWeiler, SZhang, YZhou, YZhu, T Aminopyridine derivatives and their use as selective ALK-2 inhibitors US Patent  US10710980 Publication Date 7/14/2020 
Target
Name:
Serine/threonine-protein kinase receptor R3 [166-493]
Synonyms:
ACVL1_HUMAN ACVRLK1 Activin receptor-like kinase 1 (ALK1)(aa 166-493)
Type:
Enzyme Catalytic Domain
Mol. Mass.:
36974.75
Organism:
Homo sapiens (Human)
Description:
aa 166-493
Residue:
328
  
Inhibitor
Name:
BDBM451789
Synonyms:
US10710980, Example 21 | US10947218, Example 21
Type:
Small organic molecule
Emp. Form.:
C28H35FN4O3
Mol. Mass.:
494.6009
SMILES:
Nc1ncc(cc1C(=O)N[C@@H]1CC[C@@H](O)[C@@H](F)C1)-c1ccc(cc1)[C@@]12C[C@@H]1CN(C2)C1CCOCC1
: