Target
Protein-arginine deiminase type-4
Ligand
BDBM454160
Substrate
Meas. Tech.
Inhibition Assay
Ki
35200±7000 nM
Citation
 Kotra, LPWasilewski, E Inhibitors of peptidyl arginine deiminase (PAD) enzymes and uses thereof US Patent  US10716791 Publication Date 7/21/2020 
Target
Name:
Protein-arginine deiminase type-4
Synonyms:
PAD4 PADI4_HUMAN PDI5
Type:
Enzyme Catalytic Domain
Mol. Mass.:
74078.90
Organism:
Homo sapiens (Human)
Description:
gi_216548487
Residue:
663
  
Inhibitor
Name:
BDBM454160
Synonyms:
US10716791, Code KP-224
Type:
Small organic molecule
Emp. Form.:
C15H29N3O3S
Mol. Mass.:
331.474
SMILES:
S.COC(=O)[C@H](CN1CCNCC1)NC(=O)C1CCCCC1
: