Target
Protein-arginine deiminase type-4
Ligand
BDBM454161
Substrate
Meas. Tech.
Inhibition Assay
Ki
27600±8100 nM
Citation
 Kotra, LPWasilewski, E Inhibitors of peptidyl arginine deiminase (PAD) enzymes and uses thereof US Patent  US10716791 Publication Date 7/21/2020 
Target
Name:
Protein-arginine deiminase type-4
Synonyms:
PAD4 PADI4_HUMAN PDI5
Type:
Enzyme Catalytic Domain
Mol. Mass.:
74078.90
Organism:
Homo sapiens (Human)
Description:
gi_216548487
Residue:
663
  
Inhibitor
Name:
BDBM454161
Synonyms:
US10716791, Code KP-226
Type:
Small organic molecule
Emp. Form.:
C14H23N3O4S
Mol. Mass.:
329.415
SMILES:
S.COC(=O)[C@H](CCN1CCNCC1)NC(=O)c1ccco1
: