Target
Protein-arginine deiminase type-4
Ligand
BDBM454166
Substrate
Meas. Tech.
Inhibition Assay
Ki
14940000±n/a nM
Citation
 Kotra, LPWasilewski, E Inhibitors of peptidyl arginine deiminase (PAD) enzymes and uses thereof US Patent  US10716791 Publication Date 7/21/2020 
Target
Name:
Protein-arginine deiminase type-4
Synonyms:
PAD4 PADI4_HUMAN PDI5
Type:
Enzyme Catalytic Domain
Mol. Mass.:
74078.90
Organism:
Homo sapiens (Human)
Description:
gi_216548487
Residue:
663
  
Inhibitor
Name:
BDBM454166
Synonyms:
US10716791, Code KP-292
Type:
Small organic molecule
Emp. Form.:
C14H23N5O3
Mol. Mass.:
309.3641
SMILES:
CC(C)NC(=O)[C@H](Cn1ccnc1)NC(=O)N1CCOCC1
: