Target
Protein-arginine deiminase type-4
Ligand
BDBM454167
Substrate
Meas. Tech.
Inhibition Assay
Ki
1238000±1393000 nM
Citation
 Kotra, LPWasilewski, E Inhibitors of peptidyl arginine deiminase (PAD) enzymes and uses thereof US Patent  US10716791 Publication Date 7/21/2020 
Target
Name:
Protein-arginine deiminase type-4
Synonyms:
PAD4 PADI4_HUMAN PDI5
Type:
Enzyme Catalytic Domain
Mol. Mass.:
74078.90
Organism:
Homo sapiens (Human)
Description:
gi_216548487
Residue:
663
  
Inhibitor
Name:
BDBM454167
Synonyms:
US10716791, Code KP-298
Type:
Small organic molecule
Emp. Form.:
C12H13N3O4
Mol. Mass.:
263.2493
SMILES:
COC(=O)[C@H](Cn1ccnc1)NC(=O)c1ccco1
: