Target
Protein-arginine deiminase type-4
Ligand
BDBM454169
Substrate
Meas. Tech.
Inhibition Assay
Ki
180000±12000 nM
Citation
 Kotra, LPWasilewski, E Inhibitors of peptidyl arginine deiminase (PAD) enzymes and uses thereof US Patent  US10716791 Publication Date 7/21/2020 
Target
Name:
Protein-arginine deiminase type-4
Synonyms:
PAD4 PADI4_HUMAN PDI5
Type:
Enzyme Catalytic Domain
Mol. Mass.:
74078.90
Organism:
Homo sapiens (Human)
Description:
gi_216548487
Residue:
663
  
Inhibitor
Name:
BDBM454169
Synonyms:
BDBM50246180 | US10716791, Code KP-302
Type:
Small organic molecule
Emp. Form.:
C20H23N5O2
Mol. Mass.:
365.4289
SMILES:
Cn1cccc1C(=O)N[C@@H](CCn1ccnc1)C(=O)NCc1ccccc1
: