Target
Protein-arginine deiminase type-4
Ligand
BDBM454170
Substrate
Meas. Tech.
Inhibition Assay
Ki
220000±35000 nM
Citation
 Kotra, LPWasilewski, E Inhibitors of peptidyl arginine deiminase (PAD) enzymes and uses thereof US Patent  US10716791 Publication Date 7/21/2020 
Target
Name:
Protein-arginine deiminase type-4
Synonyms:
PAD4 PADI4_HUMAN PDI5
Type:
Enzyme Catalytic Domain
Mol. Mass.:
74078.90
Organism:
Homo sapiens (Human)
Description:
gi_216548487
Residue:
663
  
Inhibitor
Name:
BDBM454170
Synonyms:
US10716791, Code KP-303
Type:
Small organic molecule
Emp. Form.:
C20H27N5O2
Mol. Mass.:
369.4607
SMILES:
O=C(NCc1ccccc1)[C@H](CCn1ccnc1)NC(=O)N1CCCCC1
: