Target
Protein-arginine deiminase type-4
Ligand
BDBM454173
Substrate
Meas. Tech.
Inhibition Assay
Ki
1453000±187000 nM
Citation
 Kotra, LPWasilewski, E Inhibitors of peptidyl arginine deiminase (PAD) enzymes and uses thereof US Patent  US10716791 Publication Date 7/21/2020 
Target
Name:
Protein-arginine deiminase type-4
Synonyms:
PAD4 PADI4_HUMAN PDI5
Type:
Enzyme Catalytic Domain
Mol. Mass.:
74078.90
Organism:
Homo sapiens (Human)
Description:
gi_216548487
Residue:
663
  
Inhibitor
Name:
BDBM454173
Synonyms:
US10716791, Code KP-310
Type:
Small organic molecule
Emp. Form.:
C16H23N5O3
Mol. Mass.:
333.3855
SMILES:
CC(C)(C)OC(=O)N[C@H](CCN=[N+]=[N-])C(=O)NCc1ccccc1
: