Target
Ribosomal protein S6 kinase alpha-2
Ligand
BDBM286092
Substrate
Meas. Tech.
Kinase Assay
IC50
123±n/a nM
Citation
 Dunn, SEJayanthan, ANagireddy, JRAnnedi, SVan Drie, JHDaynard, TSHuynh, M Carboxamide derivatives useful as rsk inhibitors US Patent  US10758530 Publication Date 9/1/2020 
Target
Name:
Ribosomal protein S6 kinase alpha-2
Synonyms:
90 kDa ribosomal protein S6 kinase 2 KS6A2_HUMAN MAPKAPK1C RPS6KA2(Kin.Dom.1 - N-terminal) Ribosomal S6 Kinase 3 (RSK-3) Ribosomal protein S6 kinase alpha 2 (RSK2) p90-RSK 2 pp90RSK3
Type:
Serine/threonine-protein kinase
Mol. Mass.:
83259.46
Organism:
Homo sapiens (Human)
Description:
Residue:
733
  
Inhibitor
Name:
BDBM286092
Synonyms:
(R)-1-(3-aminobenzyl)-N-(9-methyl-6-oxo-6,7,8,9-tetrahydropyrido[3′,2′:4,5]pyrrolo[1,2-a]pyrazin-2-yl)-1H-pyrazole-4-carboxamide US10081632, Compound 19 | US10758530, Compound 19
Type:
Small organic molecule
Emp. Form.:
C22H21N7O2
Mol. Mass.:
415.4478
SMILES:
C[C@@H]1CNC(=O)c2cc3ccc(NC(=O)c4cnn(Cc5cccc(N)c5)c4)nc3n12
: