Target
Dual specificity tyrosine-phosphorylation-regulated kinase 1A
Ligand
BDBM459187
Substrate
Meas. Tech.
Kinase Assay
EC50
3.00±n/a nM
Citation
 K C, SKMittapalli, GKChiruta, CHofilena, BJ Indazole containing macrocycles and therapeutic uses thereof US Patent  US10759799 Publication Date 9/1/2020 
Target
Name:
Dual specificity tyrosine-phosphorylation-regulated kinase 1A
Synonyms:
DYR1A_HUMAN DYRK1A Dual specificity YAK1-related kinase 1A (Dyrk1A) Dual-specificity tyrosine-phosphorylation regulated kinase 1A HP86 MNBH
Type:
Enzyme
Mol. Mass.:
85616.61
Organism:
Homo sapiens (Human)
Description:
Q13627
Residue:
763
  
Inhibitor
Name:
BDBM459187
Synonyms:
US10759799, Compound 8
Type:
Small organic molecule
Emp. Form.:
C26H19N7
Mol. Mass.:
429.476
SMILES:
C1NCc2cncc(c2)-c2ccc3[nH]nc(-c4nc5c(cncc5[nH]4)-c4cccc1c4)c3c2
: