Target
Fibroblast growth factor receptor 4
Ligand
BDBM98736
Substrate
Meas. Tech.
Omnia Assay Protocol for Potency Assessment Against (method a)
IC50
<100.0±n/a nM
Citation
 D''Agostino, LASjin, RTNiu, DMcDonald, JJZhu, ZLiu, HMazdiyasni, HPetter, RCSingh, JBarrague, MGross, AMunson, M Heteroaryl compounds and uses thereof US Patent  US10774052 Publication Date 9/15/2020 
Target
Name:
Fibroblast growth factor receptor 4
Synonyms:
CD_antigen: CD334 FGFR4 FGFR4 Fibroblast growth factor receptor JK2 TKF
Type:
Protein
Mol. Mass.:
87957.45
Organism:
Homo sapiens (Human)
Description:
P22455
Residue:
802
  
Inhibitor
Name:
BDBM98736
Synonyms:
US10189794, Compound I-155 US10774052, Compound I-155 | US9695132, I-155
Type:
Small organic molecule
Emp. Form.:
C24H22N6O3
Mol. Mass.:
442.4699
SMILES:
COc1cc(OC)cc(c1)-c1cc2cnc(Nc3ccccc3NC(=O)C=C)nc2nc1N
: