Target
E3 ubiquitin-protein ligase Mdm2 [1-188]
Ligand
BDBM215136
Substrate
Meas. Tech.
Homogenous Time-Resolved Fluorescence Assay (HTRF1 Assay)
IC50
20.0±n/a nM
Target
Name:
E3 ubiquitin-protein ligase Mdm2 [1-188]
Synonyms:
E3 ubiquitin-protein ligase Mdm2 (aa 1-188) MDM2_HUMAN
Type:
Mol. Mass.:
21319.18
Organism:
Homo sapiens (Human)
Description:
Q00987[1-188]
Residue:
188
  
Inhibitor
Name:
BDBM215136
Synonyms:
US9296736, 87 | US9593129, Example 87
Type:
Small organic molecule
Emp. Form.:
C26H31Cl2NO3
Mol. Mass.:
476.435
SMILES:
CCC(CC)N1[C@@H]([C@H](C[C@](CC)(CC(O)=O)C1=O)c1cccc(Cl)c1)c1ccc(Cl)cc1
: