Target
E3 ubiquitin-protein ligase Mdm2 [1-188]
Ligand
BDBM215228
Substrate
Meas. Tech.
Homogenous Time-Resolved Fluorescence Assay (HTRF2 Assay)
IC50
1.000±n/a nM
Target
Name:
E3 ubiquitin-protein ligase Mdm2 [1-188]
Synonyms:
E3 ubiquitin-protein ligase Mdm2 (aa 1-188) MDM2_HUMAN
Type:
Mol. Mass.:
21319.18
Organism:
Homo sapiens (Human)
Description:
Q00987[1-188]
Residue:
188
  
Inhibitor
Name:
BDBM215228
Synonyms:
US9296736, 188 | US9593129, Example 188
Type:
Small organic molecule
Emp. Form.:
C31H34Cl2N2O5S
Mol. Mass.:
617.583
SMILES:
CC[C@@H](CNS(=O)(=O)c1ccc(C)cc1)N1[C@@H]([C@H](C[C@](C)(CC(O)=O)C1=O)c1cccc(Cl)c1)c1ccc(Cl)cc1
: