Target
E3 ubiquitin-protein ligase Mdm2 [1-188]
Ligand
BDBM215371
Substrate
Meas. Tech.
Homogenous Time-Resolved Fluorescence Assay (HTRF2 Assay)
IC50
0.300±n/a nM
Target
Name:
E3 ubiquitin-protein ligase Mdm2 [1-188]
Synonyms:
E3 ubiquitin-protein ligase Mdm2 (aa 1-188) MDM2_HUMAN
Type:
Mol. Mass.:
21319.18
Organism:
Homo sapiens (Human)
Description:
Q00987[1-188]
Residue:
188
  
Inhibitor
Name:
BDBM215371
Synonyms:
US9296736, 347 | US9593129, Example 347
Type:
Small organic molecule
Emp. Form.:
C29H35Cl2NO5S
Mol. Mass.:
580.563
SMILES:
CC[C@@H](CS(=O)(=O)C1CCC1)N1[C@@H]([C@H](C[C@](CC)(CC(O)=O)C1=O)c1cccc(Cl)c1)c1ccc(Cl)cc1
: