Target
Cyclin-dependent kinase 6/G1/S-specific cyclin-D3
Ligand
BDBM462108
Substrate
Meas. Tech.
Biological Assay
Ki
1.30±n/a nM
Citation
 Chen, PCho-Schultz, SDeal, JGGallego, GMJalaie, MKania, RSNair, SKNinkovic, SOrr, STPalmer, CL Cyclin dependent kinase inhibitors US Patent  US10766884 Publication Date 9/8/2020 
Target
Name:
Cyclin-dependent kinase 6/G1/S-specific cyclin-D3
Synonyms:
CDK6/CycD3 CDK6/G1/S-specific cyclin D3 Cyclin-dependent kinase 6 | Cyclin-dependent kinase 6/G1/S-specific cyclin D3
Type:
Protein
Mol. Mass.:
Description:
Components:
This complex has 2 components.
Component 1
Name:
Cyclin-dependent kinase 6
Synonyms:
CDK6 CDKN6 Cyclin-dependent kinase 6 (CDK 6) | Serine/threonine-protein kinase PLSTIRE
Type:
Enzyme Subunit
Mol. Mass.:
36937.42
Organism:
Homo sapiens (Human)
Description:
Q00534
Residue:
326
  
Component 2
Name:
G1/S-specific cyclin-D3
Synonyms:
CCND3 | CCND3_HUMAN
Type:
Enzyme
Mol. Mass.:
32521.90
Organism:
Homo sapiens (Human)
Description:
P30281
Residue:
292
  
Inhibitor
Name:
BDBM462108
Synonyms:
US10766884, Example A25
Type:
Small organic molecule
Emp. Form.:
C21H27ClFN6O3S
Mol. Mass.:
497.994
SMILES:
CC(C)[N]1=C2C=C(C=C(F)C2N=C1C)c1nc(N[C@@H]2CCN(C[C@H]2O)S(C)(=O)=O)ncc1Cl
: