Target
Cyclin-dependent kinase 6/G1/S-specific cyclin-D3
Ligand
BDBM462173
Substrate
Meas. Tech.
Biological Assay
Ki
1.70±n/a nM
Citation
 Chen, PCho-Schultz, SDeal, JGGallego, GMJalaie, MKania, RSNair, SKNinkovic, SOrr, STPalmer, CL Cyclin dependent kinase inhibitors US Patent  US10766884 Publication Date 9/8/2020 
Target
Name:
Cyclin-dependent kinase 6/G1/S-specific cyclin-D3
Synonyms:
CDK6/CycD3 CDK6/G1/S-specific cyclin D3 Cyclin-dependent kinase 6 | Cyclin-dependent kinase 6/G1/S-specific cyclin D3
Type:
Protein
Mol. Mass.:
Description:
Components:
This complex has 2 components.
Component 1
Name:
Cyclin-dependent kinase 6
Synonyms:
CDK6 CDKN6 Cyclin-dependent kinase 6 (CDK 6) | Serine/threonine-protein kinase PLSTIRE
Type:
Enzyme Subunit
Mol. Mass.:
36937.42
Organism:
Homo sapiens (Human)
Description:
Q00534
Residue:
326
  
Component 2
Name:
G1/S-specific cyclin-D3
Synonyms:
CCND3 | CCND3_HUMAN
Type:
Enzyme
Mol. Mass.:
32521.90
Organism:
Homo sapiens (Human)
Description:
P30281
Residue:
292
  
Inhibitor
Name:
BDBM462173
Synonyms:
(Scheme A-13): (3R,4R)-4-({5-chloro-4-[1-(1,1-difluoropropan-2-yl)-4-fluoro-2-(hydroxymethyl)-1H-benzimidazol-6-yl]pyrimidin-2-yl}amino)-1-(methanesulfonyl)piperidin-3-ol US11220494, Example A91
Type:
Small organic molecule
Emp. Form.:
C23H30ClFN6O4S
Mol. Mass.:
541.039
SMILES:
CC(C)n1c(nc2c(F)cc(cc12)-c1nc(N[C@@H]2CCN(C[C@H]2O)S(C)(=O)=O)ncc1Cl)C(C)(C)O
: