Target
Prokineticin receptor 1
Ligand
BDBM463316
Substrate
Meas. Tech.
Aequorin-Based Luminescent Assay
Ki
6.14±n/a nM
Citation
 Zhou, Q Compositions and methods for treating disorders of circadian and diurnal rhythms using prokineticin 2 agonists and antagonists US Patent  US10780095 Publication Date 9/22/2020 
Target
Name:
Prokineticin receptor 1
Synonyms:
G-protein coupled receptor 73 GPR73 PK-R1 PKR1_HUMAN | PROKR1
Type:
enzyme
Mol. Mass.:
44779.92
Organism:
Homo sapiens (Human)
Description:
Q8TCW9
Residue:
393
  
Inhibitor
Name:
BDBM463316
Synonyms:
(-)-(3R)-1-(4,6-Difluoro-3- methoxybenzyl)-N-(9-chloro- 3,4-dihydro-2H-1,5- benzodioxepin-7-ylmethyl)-N- isobutylpyrrolidine-3- carboxamide | US10780095, Structure TABLE 1.14
Type:
Small organic molecule
Emp. Form.:
C27H33ClF2N2O4
Mol. Mass.:
523.012
SMILES:
COc1cc(CN2CCC(C2)C(=O)N(CC(C)C)Cc2cc(Cl)c3OCCCOc3c2)c(F)cc1F
: