Target
Prokineticin receptor 1
Ligand
BDBM463326
Substrate
Meas. Tech.
Aequorin-Based Luminescent Assay
Ki
4.40±n/a nM
Citation
 Zhou, Q Compositions and methods for treating disorders of circadian and diurnal rhythms using prokineticin 2 agonists and antagonists US Patent  US10780095 Publication Date 9/22/2020 
Target
Name:
Prokineticin receptor 1
Synonyms:
G-protein coupled receptor 73 GPR73 PK-R1 PKR1_HUMAN | PROKR1
Type:
enzyme
Mol. Mass.:
44779.92
Organism:
Homo sapiens (Human)
Description:
Q8TCW9
Residue:
393
  
Inhibitor
Name:
BDBM463326
Synonyms:
(+-)-2-Methyl-3-((3-hydroxy-4- fluoro)benzylamino)-N-(9- chloro-3,4-dihydro-2H-1,5- benzodioxepin-7-ylmethyl)-N- isobutylpropanamide | US10780095, Structure TABLE 1.24
Type:
Small organic molecule
Emp. Form.:
C25H32ClFN2O4
Mol. Mass.:
478.984
SMILES:
CC(C)CN(Cc1cc(Cl)c2OCCCOc2c1)C(=O)C(C)CNCc1ccc(F)c(O)c1
: