Target
Monoacylglycerol lipase ABHD6
Ligand
BDBM280461
Substrate
Meas. Tech.
In Vitro Competitive Activity-Based Protein Profiling Assay
IC50
>1000±n/a nM
Citation
 Buzard, DJShaghafi, MBCisar, JSGrice, CAJones, TKWeber, OD Spirocycle compounds and methods of making and using same US Patent  US10781211 Publication Date 9/22/2020 
Target
Name:
Monoacylglycerol lipase ABHD6
Synonyms:
ABHD6_MOUSE Abhd6 Monoacylglycerol lipase ABHD6
Type:
Single-pass type II membrane protein; hydrolase
Mol. Mass.:
38216.17
Organism:
Mus musculus (mouse)
Description:
Assays were using membranes of recombinant Abh6 transiently transfected in COS-7 cells.
Residue:
336
  
Inhibitor
Name:
BDBM280461
Synonyms:
US10030020, Example 6 | US10781211, Example 6
Type:
Small organic molecule
Emp. Form.:
C21H26F6N2O3
Mol. Mass.:
468.4332
SMILES:
CCOc1ccccc1CN1CCCC11CCN(CC1)C(=O)OC(C(F)(F)F)C(F)(F)F
: