Target
Monoacylglycerol lipase ABHD6
Ligand
BDBM280536
Substrate
Meas. Tech.
In Vitro Competitive Activity-Based Protein Profiling Assay
IC50
>1000±n/a nM
Citation
 Buzard, DJShaghafi, MBCisar, JSGrice, CAJones, TKWeber, OD Spirocycle compounds and methods of making and using same US Patent  US10781211 Publication Date 9/22/2020 
Target
Name:
Monoacylglycerol lipase ABHD6
Synonyms:
ABHD6_MOUSE Abhd6 Monoacylglycerol lipase ABHD6
Type:
Single-pass type II membrane protein; hydrolase
Mol. Mass.:
38216.17
Organism:
Mus musculus (mouse)
Description:
Assays were using membranes of recombinant Abh6 transiently transfected in COS-7 cells.
Residue:
336
  
Inhibitor
Name:
BDBM280536
Synonyms:
US10030020, Example 81 | US10781211, Example 81
Type:
Small organic molecule
Emp. Form.:
C23H28ClF6N3O2
Mol. Mass.:
527.931
SMILES:
FC(F)(F)C(OC(=O)N1CCC2(CCCN2Cc2cccc(N3CCCC3)c2Cl)CC1)C(F)(F)F
: