Target
Tyrosine-protein kinase JAK3
Ligand
BDBM466367
Substrate
Meas. Tech.
JAK Kinase Assays
EC50
13.6±n/a nM
Citation
 Larsen, MRitzen, ANørremark, BGreve, DR 5-(7H-pyrrolo[2,3-d]pyrimidin-4-yl)-5-azaspiro[2.5]octane-8-carboxylic acid derivatives as novel JAK kinase inhibitors US Patent  US10799507 Publication Date 10/13/2020 
Target
Name:
Tyrosine-protein kinase JAK3
Synonyms:
JAK-3 JAK3_HUMAN Janus kinase 3 (JAK3) L-JAK | Leukocyte janus kinase
Type:
Protein
Mol. Mass.:
125111.08
Organism:
Homo sapiens (Human)
Description:
P52333
Residue:
1124
  
Inhibitor
Name:
BDBM466367
Synonyms:
(8S)-N-[(2R)-2- cyclobutyl-2- hydroxy-ethyl]-5- (7H-pyrrolo[2,3- d]pyrimidin-4-yl)- 5-azaspiro [2.5]octane- 8-carboxamide | US10799507, Example 25
Type:
Small organic molecule
Emp. Form.:
C20H27N5O2
Mol. Mass.:
369.4607
SMILES:
O[C@@H](CNC(=O)[C@H]1CCN(CC11CC1)c1ncnc2[nH]ccc12)C1CCC1
: