Target
Cannabinoid receptor 2
Ligand
BDBM300211
Substrate
Meas. Tech.
cAMP Assay
EC50
0.700±n/a nM
Citation
 Grether, UNettekoven, MRogers-Evans, MRoever, SSchmitt, SKimbara, A Triazolo[4,5-D]pyrimidine derivatives US Patent  US9593123 Publication Date 3/14/2017 
Target
Name:
Cannabinoid receptor 2
Synonyms:
CANNABINOID CB2 CB2 CB2B CNR2_HUMAN Cannabinoid CB2 receptor Cannabinoid receptor 2 (CB2R) | hCB2
Type:
G Protein-Coupled Receptor (GPCR)
Mol. Mass.:
39690.94
Organism:
Homo sapiens (Human)
Description:
P34972
Residue:
360
  
Inhibitor
Name:
BDBM300211
Synonyms:
3-[(2-Chlorophenyl)methyl]-7-(3,3-difluoropyrrolidin-1-yl)-5-ethylsulfanyltriazolo [4,5-d]pyrimidine | US9593123, Example 82
Type:
Small organic molecule
Emp. Form.:
C17H17ClF2N6S
Mol. Mass.:
410.872
SMILES:
CCSc1nc(N2CCC(F)(F)C2)c2nnn(Cc3ccccc3Cl)c2n1
: