Target
Metabotropic glutamate receptor 2
Ligand
BDBM403492
Substrate
Meas. Tech.
Biological Assays
IC50
21.0±n/a nM
Citation
 Sebhat, IKArasappan, AHoyt, SBWilkening, RRDeMong, D Chromane, isochromane and dihydroisobenzofuran derivatives as mGluR2-negative allosteric modulators, compositions, and their use US Patent  US10806724 Publication Date 10/20/2020 
Target
Name:
Metabotropic glutamate receptor 2
Synonyms:
GPRC1B GRM2_HUMAN Metabotropic glutamate receptor mGlu2 | metabotropic glutamate 2
Type:
Enzyme
Mol. Mass.:
95584.88
Organism:
Homo sapiens (Human)
Description:
Q14416
Residue:
872
  
Inhibitor
Name:
BDBM403492
Synonyms:
US10335399, Example 4-2A | US10806724, Example 4-2A
Type:
Small organic molecule
Emp. Form.:
C18H16F5N3O2
Mol. Mass.:
401.3306
SMILES:
NC(=O)c1cc(c2CC[C@H](CNCC(F)(F)F)Oc2n1)-c1ccc(F)cc1F
: