Target
Glycogen synthase kinase-3 beta
Ligand
BDBM11436
Substrate
GSK-3 Peptide Substrate
Meas. Tech.
Kinase Inhibition Assay
Temperature
303.15±n/a K
IC50
>50000±n/a nM
Comments
extracted
Citation
 Voigt, BMeijer, LLozach, OSchachtele, CTotzke, FHilgeroth, A Novel CDK inhibition profiles of structurally varied 1-aza-9-oxafluorenes. Bioorg Med Chem Lett 15:823-5 (2005)  
Target
Name:
Glycogen synthase kinase-3 beta
Synonyms:
GSK-3, beta Glycogen Synthase Kinase-3, beta | Gsk3b
Type:
Enzyme
Mol. Mass.:
46754.43
Organism:
Rattus norvegicus (rat)
Description:
The rat GSK-3 beta cDNA was inserted into the baculovirus vector. The protein was purified from virus-infected sf9 insect cells
Residue:
420
  
Inhibitor
Name:
BDBM11436
Synonyms:
4-({5-[(3-aminocyclohexyl)amino]-3-(propan-2-yl)pyrazolo[1,5-a]pyrimidin-7-yl}amino)-N,N-dimethylbenzene-1-sulfonamide | pyrazolo[1,5-a]pyrimidine 9i
Type:
Small organic molecule
Emp. Form.:
C23H33N7O2S
Mol. Mass.:
471.619
SMILES:
CC(C)c1cnn2c(Nc3ccc(cc3)S(=O)(=O)N(C)C)cc(NC3CCCC(N)C3)nc12
:
Substrate
Name:
GSK-3 Peptide Substrate
Synonyms:
GS-1 Peptide | Phospho-GS2 Substrate Peptide
Type:
Peptide
Mol. Mass.:
3045.17
Organism:
Description:
Residue:
27