Target
NADPH oxidase 1
Ligand
BDBM300411
Substrate
Meas. Tech.
ROS Production Measurement on hNOX1 Membranes
Ki
22.0±n/a nM
Citation
 Machin, PSharpe, ALock, CJChambers, MSHodges, AAllen, VEllard, JM Amido thiadiazole derivatives as NADPH oxidase inhibitors US Patent  US10130619 Publication Date 11/20/2018 
Target
Name:
NADPH oxidase 1
Synonyms:
MOX-1 Mitogenic oxidase 1 NOH-1 NOX-1 NOX1_HUMAN
Type:
PROTEIN
Mol. Mass.:
64890.44
Organism:
Homo sapiens (Human)
Description:
ChEMBL_792877
Residue:
564
  
Inhibitor
Name:
BDBM300411
Synonyms:
US10130619, Example 158
Type:
Small organic molecule
Emp. Form.:
C24H20N4O3S
Mol. Mass.:
444.506
SMILES:
COc1cc(ccc1OC1Cc2ccccc2C1)C(=O)Nc1nnc(s1)-c1ccncc1
: