Target
Beta-arrestin-1
Ligand
BDBM472715
Substrate
Meas. Tech.
beta-Arrestin Assay
EC50
3670±n/a nM
Citation
 Tounge, BABayoumy, SKuo, LCDax, SL Substituted 3-dialkylaminomethyl-piperidin-4-yl-benzamides and methods of making and using same US Patent  US10836728 Publication Date 11/17/2020 
Target
Name:
Beta-arrestin-1
Synonyms:
ARR1 ARRB1_HUMAN | Arrestin, beta 1
Type:
Enzyme Catalytic Domain
Mol. Mass.:
47062.57
Organism:
Homo sapiens (Human)
Description:
gi_13177715
Residue:
418
  
Inhibitor
Name:
BDBM472715
Synonyms:
US10836728, Compound Ent-B-syn-(6)
Type:
Small organic molecule
Emp. Form.:
C22H27ClFN3O2
Mol. Mass.:
419.92
SMILES:
CN(C)C[C@@H]1CN(Cc2ccc(F)cc2Cl)CC[C@@]1(O)c1cccc(c1)C(N)=O
: