Target
Cyclin-dependent kinase 1/G2/mitotic-specific cyclin-B
Ligand
BDBM7506
Substrate
Histone H1
Meas. Tech.
Kinase Inhibition Assay
pH
7.2±n/a
Temperature
303.15±n/a K
IC50
11000±n/a nM
Citation
 Legraverend, MLudwig, OBisagni, ELeclerc, SMeijer, LGiocanti, NSadri, RFavaudon, V Synthesis and in vitro evaluation of novel 2,6,9-trisubstituted purines acting as cyclin-dependent kinase inhibitors. Bioorg Med Chem 7:1281-93 (1999)  
Target
Name:
Cyclin-dependent kinase 1/G2/mitotic-specific cyclin-B
Synonyms:
CDK1/Cyclin B p34cdc2/Cyclin B
Type:
Protein Complex
Mol. Mass.:
Description:
p34cdc2/cyclin B was purified from M-phase starfish oocytes by affinity chromatography.
Components:
This complex has 2 components.
Component 1
Name:
Cyclin-dependent kinase 1
Synonyms:
CDK1_ORYLA P34 protein kinase cdk1
Type:
Enzyme Subunit
Mol. Mass.:
34693.35
Organism:
Marthasterias glacialis (starfish)
Description:
Q9DGD3 {empty hard to find)
Residue:
303
  
Component 2
Name:
G2/mitotic-specific cyclin-B
Synonyms:
CCNB_MARGL G2/mitotic-specific cyclin-B1
Type:
Enzyme Subunit
Mol. Mass.:
43790.28
Organism:
Marthasterias glacialis (starfish)
Description:
Residue:
388
  
Inhibitor
Name:
BDBM7506
Synonyms:
2,6,9-Trisubstituted purine deriv. 5b CHEMBL131031
Type:
Small organic molecule
Emp. Form.:
C12H16IN5
Mol. Mass.:
357.1934
SMILES:
CC(C)n1cnc2c(nc(I)nc12)N(C)CC=C
:
Substrate
Name:
Histone H1
Synonyms:
Type:
Other Protein Type
Mol. Mass.:
358.43
Organism:
Bos taurus (bovine)
Description:
Residue:
3
NA