Target
Cyclin-dependent kinase 5 activator 1
Ligand
BDBM7515
Substrate
Histone H1
Meas. Tech.
Kinase Inhibition Assay
Temperature
303.15±n/a K
IC50
1300±n/a nM
Comments
extracted
Citation
 Legraverend, MLudwig, OBisagni, ELeclerc, SMeijer, LGiocanti, NSadri, RFavaudon, V Synthesis and in vitro evaluation of novel 2,6,9-trisubstituted purines acting as cyclin-dependent kinase inhibitors. Bioorg Med Chem 7:1281-93 (1999)  
Target
Name:
Cyclin-dependent kinase 5 activator 1
Synonyms:
CDK5/p35 Cyclin-dependent kinase 5 regulatory subunit 1 | Cyclin-dependent kinase 5/CDK5 activator 1
Type:
Protein Complex
Mol. Mass.:
Description:
Components:
This complex has 2 components.
Component 1
Name:
Cyclin-dependent kinase 5
Synonyms:
CDK5 CDKN5 Cyclin-dependent kinase 5 (CDK5/ p25) Cyclin-dependent-like kinase 5 PSSALRE Tau protein kinase II catalytic subunit
Type:
Enzyme Subunit
Mol. Mass.:
33308.61
Organism:
Homo sapiens (Human)
Description:
Residue:
292
  
Component 2
Name:
Cyclin-dependent kinase 5 activator 1
Synonyms:
CD5R1_HUMAN CDK5R1 Cyclin-dependent kinase 5 (CDK5/p25) NCK5A p35
Type:
Enzyme Subunit
Mol. Mass.:
34077.43
Organism:
Homo sapiens (Human)
Description:
Q15078
Residue:
307
  
Inhibitor
Name:
BDBM7515
Synonyms:
2,6,9-Trisubstituted purine deriv. 10 | [(2R)-1-[6-(benzylamino)-9-(propan-2-yl)-9H-purin-2-yl]pyrrolidin-2-yl]methanol
Type:
Small organic molecule
Emp. Form.:
C20H26N6O
Mol. Mass.:
366.46
SMILES:
CC(C)n1cnc2c(NCc3ccccc3)nc(nc12)N1CCC[C@@H]1CO
:
Substrate
Name:
Histone H1
Synonyms:
Type:
Other Protein Type
Mol. Mass.:
358.43
Organism:
Bos taurus (bovine)
Description:
Residue:
3
NA