Target
Neprilysin
Ligand
BDBM300739
Substrate
Meas. Tech.
Enzyme Inhibition Assays
Ki
35.5±n/a nM
Citation
 Fleury, MGendron, RHughes, AD Neprilysin inhibitors US Patent  US10130642 Publication Date 11/20/2018 
Target
Name:
Neprilysin
Synonyms:
Atriopeptidase CD_antigen=CD10 EPN MME NEP_HUMAN Neutral endopeptidase | Neutral endopeptidase 24.11
Type:
Enzyme
Mol. Mass.:
85505.38
Organism:
Homo sapiens (Human)
Description:
P08473
Residue:
750
  
Inhibitor
Name:
BDBM300739
Synonyms:
US10130642, Example 4-35
Type:
Small organic molecule
Emp. Form.:
C22H25N3O4
Mol. Mass.:
395.4516
SMILES:
Cc1nc2c(C)cc(cc2[nH]1)C(=O)NC(CC(CO)C(O)=O)Cc1ccccc1
: