Target
Tyrosine-protein kinase BTK
Ligand
BDBM303600
Substrate
Meas. Tech.
BTK Assay
IC50
6.70±n/a nM
Citation
 Bentzien, JBerry, AKBosanac, TBurke, MJDisalvo, DTHoran, JCLiang, SMao, CMao, WShen, YSoleymanzadeh, FZindell, RM Heteroaromatic compounds as BTK inhibitors US Patent  US10875852 Publication Date 12/29/2020 
Target
Name:
Tyrosine-protein kinase BTK
Synonyms:
AGMX1 Agammaglobulinaemia tyrosine kinase B cell progenitor kinase BPK BTK_HUMAN Tyrosine Kinase BTK Tyrosine-protein kinase BTK (BTK)
Type:
Enzyme
Mol. Mass.:
76289.95
Organism:
Homo sapiens (Human)
Description:
Q06187
Residue:
659
  
Inhibitor
Name:
BDBM303600
Synonyms:
BDBM303601 US10875852, Example 113
Type:
Small organic molecule
Emp. Form.:
C22H25N5O3
Mol. Mass.:
407.4656
SMILES:
NC(=O)c1c(N)n(nc1-c1ccc(OC2CC2)cc1)C1CC2(C1)CN(C2)C(=O)C=C
: