Target
Free fatty acid receptor 1
Ligand
BDBM300815
Substrate
Meas. Tech.
GPR40 Calcium Flux Assay
EC50
7.00±n/a nM
Citation
 Huang, HKuo, GPlayer, MRYang, SZhang, Y Substituted benzothiophenyl derivatives as GPR40 agonists for the treatment of type II diabetes US Patent  US10131648 Publication Date 11/20/2018 
Target
Name:
Free fatty acid receptor 1
Synonyms:
FFAR1 G-protein Coupled Receptor 40 | GPR40
Type:
G Protein-Coupled Receptor (GPCR)
Mol. Mass.:
31473.32
Organism:
Homo sapiens (Human)
Description:
O14842
Residue:
300
  
Inhibitor
Name:
BDBM300815
Synonyms:
(3S)-3-(4-((3-(4-(2,3- Dihydroxypropoxy)-2- methylphenyl)benzo[b]thiophen- 5-yl)methoxy)phenyl) hex-4-ynoic acid US10195178, Compound 13 | US9790198, Compound 13
Type:
Small organic molecule
Emp. Form.:
C31H30O6S
Mol. Mass.:
530.631
SMILES:
CC#C[C@@H](CC(O)=O)c1ccc(OCc2ccc3scc(-c4ccc(OCC(O)CO)cc4C)c3c2)cc1
: