Target
Free fatty acid receptor 1
Ligand
BDBM300804
Substrate
Meas. Tech.
GPR40 Calcium Flux Assay
EC50
10.00±n/a nM
Citation
 Huang, HKuo, GPlayer, MRYang, SZhang, Y Substituted benzothiophenyl derivatives as GPR40 agonists for the treatment of type II diabetes US Patent  US10131648 Publication Date 11/20/2018 
Target
Name:
Free fatty acid receptor 1
Synonyms:
FFAR1 G-protein Coupled Receptor 40 | GPR40
Type:
G Protein-Coupled Receptor (GPCR)
Mol. Mass.:
31473.32
Organism:
Homo sapiens (Human)
Description:
O14842
Residue:
300
  
Inhibitor
Name:
BDBM300804
Synonyms:
(3S)-3-[4-[[3-(2- Methylphenyl)benzo[b]thiophen- 5-yl]methoxy]phenyl] hex-4-ynoic acid US10131648, Compound 23 US9790198, Compound 2
Type:
Small organic molecule
Emp. Form.:
C28H24O3S
Mol. Mass.:
440.553
SMILES:
CC#C[C@@H](CC(O)=O)c1ccc(OCc2ccc3scc(-c4ccccc4C)c3c2)cc1
: