Target
Free fatty acid receptor 1
Ligand
BDBM300827
Substrate
Meas. Tech.
GPR40 Calcium Flux Assay
EC50
24.0±n/a nM
Citation
 Huang, HKuo, GPlayer, MRYang, SZhang, Y Substituted benzothiophenyl derivatives as GPR40 agonists for the treatment of type II diabetes US Patent  US10131648 Publication Date 11/20/2018 
Target
Name:
Free fatty acid receptor 1
Synonyms:
FFAR1 G-protein Coupled Receptor 40 | GPR40
Type:
G Protein-Coupled Receptor (GPCR)
Mol. Mass.:
31473.32
Organism:
Homo sapiens (Human)
Description:
O14842
Residue:
300
  
Inhibitor
Name:
BDBM300827
Synonyms:
(3S)-3-(4-(((3-(4-(1,1-Dioxido- 3,6-dihydro-2H-thiopyran-4-yl)- 2-methylphenyl) benzo[b]thiophen-5- yl)oxy)methyl)phenyl) hex-4-ynoic acid US10195178, Compound 25 | US9790198, Compound 25
Type:
Small organic molecule
Emp. Form.:
C33H30O5S2
Mol. Mass.:
570.718
SMILES:
CC#C[C@@H](CC(O)=O)c1ccc(COc2ccc3scc(-c4ccc(cc4C)C4=CCS(=O)(=O)CC4)c3c2)cc1
: