Target
Free fatty acid receptor 1
Ligand
BDBM300834
Substrate
Meas. Tech.
GPR40 Calcium Flux Assay
EC50
36.0±n/a nM
Citation
 Huang, HKuo, GPlayer, MRYang, SZhang, Y Substituted benzothiophenyl derivatives as GPR40 agonists for the treatment of type II diabetes US Patent  US10131648 Publication Date 11/20/2018 
Target
Name:
Free fatty acid receptor 1
Synonyms:
FFAR1 G-protein Coupled Receptor 40 | GPR40
Type:
G Protein-Coupled Receptor (GPCR)
Mol. Mass.:
31473.32
Organism:
Homo sapiens (Human)
Description:
O14842
Residue:
300
  
Inhibitor
Name:
BDBM300834
Synonyms:
2-(1-(4-((3-(4-(2- Ethoxyethoxy)-2- methylphenyl)benzo[b]thiophen- 5-yl)methoxy)phenyl)-3- oxocyclobutyl)acetic acid US10195178, Compound 32 | US9790198, Compound 32
Type:
Small organic molecule
Emp. Form.:
C32H32O6S
Mol. Mass.:
544.658
SMILES:
CCOCCOc1ccc(-c2csc3ccc(COc4ccc(cc4)C4(CC(O)=O)CC(=O)C4)cc23)c(C)c1
: