Target
Free fatty acid receptor 1
Ligand
BDBM300837
Substrate
Meas. Tech.
GPR40 Calcium Flux Assay
EC50
26.0±n/a nM
Citation
 Huang, HKuo, GPlayer, MRYang, SZhang, Y Substituted benzothiophenyl derivatives as GPR40 agonists for the treatment of type II diabetes US Patent  US10131648 Publication Date 11/20/2018 
Target
Name:
Free fatty acid receptor 1
Synonyms:
FFAR1 G-protein Coupled Receptor 40 | GPR40
Type:
G Protein-Coupled Receptor (GPCR)
Mol. Mass.:
31473.32
Organism:
Homo sapiens (Human)
Description:
O14842
Residue:
300
  
Inhibitor
Name:
BDBM300837
Synonyms:
2-((1r,3r)-3-Hydroxy-1-(4-((3- (4-(2-ethoxyethoxy)-2- methylphenyl) benzo[b]thiophen-5- yl)methoxy)phenyl)cyclobutyl) acetic acid US10195178, Compound 35 | US9790198, Compound 35
Type:
Small organic molecule
Emp. Form.:
C32H34O6S
Mol. Mass.:
546.674
SMILES:
CCOCCOc1ccc(-c2csc3ccc(COc4ccc(cc4)[C@@]4(CC(O)=O)C[C@H](O)C4)cc23)c(C)c1
: