Target
Free fatty acid receptor 1
Ligand
BDBM300838
Substrate
Meas. Tech.
GPR40 Calcium Flux Assay
EC50
43.0±n/a nM
Citation
 Huang, HKuo, GPlayer, MRYang, SZhang, Y Substituted benzothiophenyl derivatives as GPR40 agonists for the treatment of type II diabetes US Patent  US10131648 Publication Date 11/20/2018 
Target
Name:
Free fatty acid receptor 1
Synonyms:
FFAR1 G-protein Coupled Receptor 40 | GPR40
Type:
G Protein-Coupled Receptor (GPCR)
Mol. Mass.:
31473.32
Organism:
Homo sapiens (Human)
Description:
O14842
Residue:
300
  
Inhibitor
Name:
BDBM300838
Synonyms:
2-((1r,3r)-1-(4-((3-(4-((1,1- Dioxidotetrahydro-2H- thiopyran-4-yl)oxy)-2- methylphenyl)benzo[b]thiophen- 5-yl)methoxy)phenyl)-3- hydroxycyclobutyl)acetic acid US10195178, Compound 36 | US9790198, Compound 36
Type:
Small organic molecule
Emp. Form.:
C33H34O7S2
Mol. Mass.:
606.749
SMILES:
Cc1cc(OC2CCS(=O)(=O)CC2)ccc1-c1csc2ccc(COc3ccc(cc3)[C@@]3(CC(O)=O)C[C@H](O)C3)cc12
: