Target
Free fatty acid receptor 1
Ligand
BDBM300841
Substrate
Meas. Tech.
GPR40 Calcium Flux Assay
EC50
46.0±n/a nM
Citation
 Huang, HKuo, GPlayer, MRYang, SZhang, Y Substituted benzothiophenyl derivatives as GPR40 agonists for the treatment of type II diabetes US Patent  US10131648 Publication Date 11/20/2018 
Target
Name:
Free fatty acid receptor 1
Synonyms:
FFAR1 G-protein Coupled Receptor 40 | GPR40
Type:
G Protein-Coupled Receptor (GPCR)
Mol. Mass.:
31473.32
Organism:
Homo sapiens (Human)
Description:
O14842
Residue:
300
  
Inhibitor
Name:
BDBM300841
Synonyms:
2-((1r,3r)-3-Hydroxy-1-(4-((3- (2-methylpyridin-3- yl)benzo[b]thiophen-5- yl)methoxy)phenyl)cyclobutyl) acetic acid US10195178, Compound 39 | US9790198, Compound 39
Type:
Small organic molecule
Emp. Form.:
C27H25NO4S
Mol. Mass.:
459.557
SMILES:
Cc1ncccc1-c1csc2ccc(COc3ccc(cc3)[C@@]3(CC(O)=O)C[C@H](O)C3)cc12
: