Target
Estrogen receptor
Ligand
BDBM300955
Substrate
Meas. Tech.
MCF-7 ER Down-Regulation Assay
IC50
0.098±n/a nM
Citation
 Barlaam, BCO Donovan, DHHughes, SJMoss, TANissink, JWScott, JSYang, B Chemical compounds US Patent  US10131663 Publication Date 11/20/2018 
Target
Name:
Estrogen receptor
Synonyms:
ER ESR ESR1_HUMAN Estrogen receptor Estrogen receptor (ER-alpha) Estrogen receptor alpha (ER) Nuclear receptor subfamily 3 group A member 1
Type:
Protein
Mol. Mass.:
66230.44
Organism:
Homo sapiens (Human)
Description:
P03372
Residue:
595
  
Inhibitor
Name:
BDBM300955
Synonyms:
N-(4-((6S,8R)-7-(2,2-difluoroethyl)-8-methyl-6,7,8,9-tetrahydro-3H-pyrazolo[4,3-f]isoquinolin-6-yl)-3-methoxyphenyl)-1-(3-fluoropropyl)azetidin-3-amine US10590130, Example 21 | US10961241, Example 21
Type:
Small organic molecule
Emp. Form.:
C26H32F3N5O
Mol. Mass.:
487.5604
SMILES:
COc1cc(NC2CN(CCCF)C2)ccc1[C@H]1N(CC(F)F)[C@H](C)Cc2c1ccc1[nH]ncc21
: