Target
Dihydroorotate dehydrogenase (quinone), mitochondrial
Ligand
BDBM50069959
Substrate
Meas. Tech.
Method for Testing Activities of Compounds at Enzyme Level
IC50
8.45±0.05 nM
Citation
 Li, HXu, YWang, RZhao, ZSong, WXu, L Thiazole derivative and applications US Patent  US10919869 Publication Date 2/16/2021 
Target
Name:
Dihydroorotate dehydrogenase (quinone), mitochondrial
Synonyms:
DHODH Dihydroorotate dehydrogenase Dihydroorotate dehydrogenase, mitochondrial Dihydroorotate oxidase (DHODH) | PYRD_HUMAN
Type:
Enzyme
Mol. Mass.:
42881.33
Organism:
Homo sapiens (Human)
Description:
Q02127
Residue:
395
  
Inhibitor
Name:
BDBM50069959
Synonyms:
Brequinar sodium Sodium; 6-fluoro-2-(2'-fluoro-biphenyl-4-yl)-3-methyl-quinoline-4-carboxylate | US10919869, Brequinar
Type:
Small organic molecule
Emp. Form.:
C23H14F2NO2
Mol. Mass.:
374.3601
SMILES:
Cc1c(nc2ccc(F)cc2c1C([O-])=O)-c1ccc(cc1)-c1ccccc1F
: