Target
Serine hydroxymethyltransferase, cytosolic
Ligand
BDBM485174
Substrate
Meas. Tech.
Enzymatic Assay
IC50
>5000±n/a nM
Citation
 Rabinowitz, JDKim, HDucker, GSGhergurovich, JM SHMT inhibitors US Patent  US10934305 Publication Date 3/2/2021 
Target
Name:
Serine hydroxymethyltransferase, cytosolic
Synonyms:
GLYC_HUMAN SHMT Serine methylase
Type:
PROTEIN
Mol. Mass.:
53091.10
Organism:
Homo sapiens (Human)
Description:
ChEMBL_745716
Residue:
483
  
Inhibitor
Name:
BDBM485174
Synonyms:
US10934305, Compound GD-07
Type:
Small organic molecule
Emp. Form.:
C15H13N5O3
Mol. Mass.:
311.2954
SMILES:
Cc1n[nH]c2OC(N)=C(C#N)C(C)(c12)c1cccc(c1)N(=O)=O
: