Target
Serine hydroxymethyltransferase, cytosolic
Ligand
BDBM285673
Substrate
Meas. Tech.
Enzymatic Assay
IC50
1191±n/a nM
Citation
 Rabinowitz, JDKim, HDucker, GSGhergurovich, JM SHMT inhibitors US Patent  US10934305 Publication Date 3/2/2021 
Target
Name:
Serine hydroxymethyltransferase, cytosolic
Synonyms:
GLYC_HUMAN SHMT Serine methylase
Type:
PROTEIN
Mol. Mass.:
53091.10
Organism:
Homo sapiens (Human)
Description:
ChEMBL_745716
Residue:
483
  
Inhibitor
Name:
BDBM285673
Synonyms:
US10077273, Compound HK-3 | US10934305, Compound HK-3
Type:
Small organic molecule
Emp. Form.:
C18H17ClN4O
Mol. Mass.:
340.807
SMILES:
Cc1n[nH]c2OC(N)=C(C#N)C(C3CCC3)(c12)c1cccc(Cl)c1
: