Target
Serine hydroxymethyltransferase, cytosolic
Ligand
BDBM485175
Substrate
Meas. Tech.
Enzymatic Assay
IC50
1768±n/a nM
Citation
 Rabinowitz, JDKim, HDucker, GSGhergurovich, JM SHMT inhibitors US Patent  US10934305 Publication Date 3/2/2021 
Target
Name:
Serine hydroxymethyltransferase, cytosolic
Synonyms:
GLYC_HUMAN SHMT Serine methylase
Type:
PROTEIN
Mol. Mass.:
53091.10
Organism:
Homo sapiens (Human)
Description:
ChEMBL_745716
Residue:
483
  
Inhibitor
Name:
BDBM485175
Synonyms:
US10934305, Compound HK-1 | US10934305, Compound HK-4
Type:
Small organic molecule
Emp. Form.:
C19H17F3N4O
Mol. Mass.:
374.3597
SMILES:
Cc1n[nH]c2OC(N)=C(C#N)C(C3CCC3)(c12)c1cccc(c1)C(F)(F)F
: