Target
Serine hydroxymethyltransferase, cytosolic
Ligand
BDBM485179
Substrate
Meas. Tech.
Enzymatic Assay
IC50
756±n/a nM
Citation
 Rabinowitz, JDKim, HDucker, GSGhergurovich, JM SHMT inhibitors US Patent  US10934305 Publication Date 3/2/2021 
Target
Name:
Serine hydroxymethyltransferase, cytosolic
Synonyms:
GLYC_HUMAN SHMT Serine methylase
Type:
PROTEIN
Mol. Mass.:
53091.10
Organism:
Homo sapiens (Human)
Description:
ChEMBL_745716
Residue:
483
  
Inhibitor
Name:
BDBM485179
Synonyms:
US10934305, Compound HK-5 | US10934305, Compound HK-8
Type:
Small organic molecule
Emp. Form.:
C18H17F3N4O
Mol. Mass.:
362.349
SMILES:
CC(C)C1(c2c(C)n[nH]c2OC(N)=C1C#N)c1cccc(c1)C(F)(F)F
: